AssertionError exception is thrown by SqlFunctionMetadataBuilderContributorIllegalClassArgumentTest when executing on IBM JDK 8

Description

When using IBM JDK 8 (see Environment details), a java.lang.AssertionError exception is thrown by SqlFunctionMetadataBuilderContributorIllegalClassArgumentTest when the following commands are executed to run the Hibernate ORM tests.


Stack trace:
...
10:40:04 org.hibernate.boot.spi.metadatabuildercontributor.SqlFunctionMetadataBuilderContributorIllegalClassArgumentTest > test FAILED
10:40:04 java.lang.AssertionError
10:40:04 at org.junit.Assert.fail(Assert.java:86)
10:40:04 at org.junit.Assert.assertTrue(Assert.java:41)
10:40:04 at org.junit.Assert.assertTrue(Assert.java:52)
10:40:04 at org.hibernate.boot.spi.metadatabuildercontributor.SqlFunctionMetadataBuilderContributorIllegalClassArgumentTest.buildEntityManagerFactory(SqlFunctionMetadataBuilderContributorIllegalClassArgumentTest.java:38)
...

Environment

Java(TM) SE Runtime Environment (build 8.0.6.5 - pxa6480sr6fp5-20200111_02(SR6 FP5))
08:45:01 IBM J9 VM (build 2.9, JRE 1.8.0 Linux amd64-64-Bit Compressed References 20200108_436782 (JIT enabled, AOT enabled)
08:45:01 OpenJ9 - 7d1059c
08:45:01 OMR - d059105
08:45:01 IBM - c8aee39)

Assignee

Unassigned

Reporter

Fabio Burzigotti

Fix versions

None

Labels

None

backPortable

None

Suitable for new contributors

None

Requires Release Note

None

Pull Request

None

backportDecision

None

Components

Affects versions

Priority

Major
Configure