We're updating the issue view to help you get more done. 

Build order of Maven modules is incorrect

Description

The JGroups integration module and the JMS integration module are being built before the hibernate-search-engine module, causing:

1 2 3 4 5 6 7 8 9 10 11 12 13 14 15 16 17 18 19 20 21 22 23 24 25 26 27 28 29 30 31 32 33 34 35 36 37 38 39 40 41 [INFO] ------------------------------------------------------------------------ [INFO] Reactor Summary: [INFO] [INFO] Hibernate Search Aggregator ........................ FAILURE [ 17.118 s] [INFO] Hibernate Search Build Configuration ............... SKIPPED [INFO] Hibernate Search [Deprecated Module] ............... SKIPPED [INFO] Hibernate Search Engine ............................ SKIPPED [INFO] Hibernate Search Avro Serialization ................ SKIPPED [INFO] Hibernate Search ORM ............................... SKIPPED [INFO] Hibernate Search JGroups Backend ................... SKIPPED [INFO] Hibernate Search JMS Backend ....................... SKIPPED [INFO] Hibernate Search Testing ........................... SKIPPED [INFO] Hibernate Search Infinispan Directory Provider ..... SKIPPED [INFO] Hibernate Search Wildfly Module .................... SKIPPED [INFO] Hibernate Search JMS Integration Tests ............. SKIPPED [INFO] Hibernate Search Narayana Integration Tests ........ SKIPPED [INFO] Hibernate Search Spring Integration Tests .......... SKIPPED [INFO] Hibernate Search Wildfly Integration Tests ......... SKIPPED [INFO] Hibernate Search Performance Tests ................. SKIPPED [INFO] Hibernate Search Karaf Features Definition ......... SKIPPED [INFO] Hibernate Search Sandbox Performance Tests ......... SKIPPED [INFO] Hibernate Search Manual ............................ SKIPPED [INFO] Hibernate Search Distribution ...................... SKIPPED [INFO] Hibernate Search OSGi Karaf Integration Tests ...... SKIPPED [INFO] ------------------------------------------------------------------------ [INFO] BUILD FAILURE [INFO] ------------------------------------------------------------------------ [INFO] Total time: 31.097 s [INFO] Finished at: 2015-09-24T08:03:22+00:00 [INFO] Final Memory: 43M/561M [INFO] ------------------------------------------------------------------------ [ERROR] Failed to execute goal on project hibernate-search-serialization-avro: Could not resolve dependencies for project org.hibernate:hibernate-search-serialization-avro:jar:5.6.0-SNAPSHOT: Could not find artifact org.hibernate:hibernate-search-engine:jar:5.6.0-SNAPSHOT in jboss-public-repository-group (https://repository.jboss.org/nexus/content/groups/public-jboss/) -> [Help 1] [ERROR] [ERROR] To see the full stack trace of the errors, re-run Maven with the -e switch. [ERROR] Re-run Maven using the -X switch to enable full debug logging. [ERROR] [ERROR] For more information about the errors and possible solutions, please read the following articles: [ERROR] [Help 1] http://cwiki.apache.org/confluence/display/MAVEN/DependencyResolutionException [ERROR] [ERROR] After correcting the problems, you can resume the build with the command [ERROR] mvn <goals> -rf :hibernate-search-serialization-avro

This probably happened when we changed the build strategy for javadocs, but was not noticed as a previous valid snapshot did exist already.

Environment

None

Status

Assignee

Davide D'Alto

Reporter

Sanne Grinovero

Labels

None

Suitable for new contributors

None

Feedback Requested

None

Components

Fix versions

Priority

Blocker